{"text_format":"1","workbook":"xlsx","n_sheets":4,"sheets":["Marriott Rooming List Template","Rooming List","Stay Pattern","Hidden - Lists"],"not_rendered":{"charts":0,"images":1,"macros":1,"external_links":1,"defined_names":12,"comments":3,"pivot_tables":0},"unopened":[],"bounds":{"document_bytes":16777216,"sheet_cells":100000,"rows_first":2000,"rows_last":500,"rows_between":2000,"halvings":0,"cell_chars":16384,"cell_head_chars":4096},"cells_cut":0,"cells_raw":0,"read":"whole","date_system":"1900"}

{"sheet":"Marriott Rooming List Template","index":0,"n_rows":9,"n_cols":45,"rows_kept":9,"cut":false,"hidden":true,"merged":[[6,29,6,44],[5,21,5,28],[6,0,6,1],[6,2,6,5],[6,6,6,9],[6,10,6,13],[6,21,6,28],[5,14,5,20],[2,0,2,3],[2,5,2,6],[3,0,3,3],[3,5,3,6],[5,10,5,13]]}
["Marriott Rooming List Template"]
[]
["EVENT NAME",null,null,null,"ARRIVAL DATE","MARSHA CODE"]
[{"$f":"'Rooming List'!D2","v":0},null,null,null,{"$f":"MIN('Rooming List'!E:E)","v":"00:00:00"},{"$f":"'Hidden - Lists'!B10","v":0}]
[]
[null,"Reservation Information ",null,null,null,null,null,null,null,null,"Guarantee / Payment",null,null,null,"    Preferences",null,null,null,null,null,null,"     Additional Guest Details (Optional) ",null,null,null,null,null,null,null,null,"    Shares (Optional): Additional Guest Names"]
[null,null,"*Required"]
[]
[null,"Title ","*First Name","*Last Name","*Arrival Date","*Departure Date","Group Code","Billing Method","Marriott Bonvoy™ Member Number","Email ","Credit Card Number","Credit Card \nExp. Date\n(mm/yy)","Credit Card First Name","Credit Card Last Name","Bed Type Request","Accessible","Smoking Preference (US and Canada are non-smoking)","Comments","Special Request Code #1","Special Request Code #2","Special Request Code #3","Company ","Address Line","City","State/Province","Zip or Postal Code","Country or Region","Telephone","Number of Guests in the Room\n(up to five)",null,"Title\n#2","First Name #2","Last Name #2",null,"Title\n#3","First Name #3","Last Name #3",null,"Title\n#4","First Name #4","Last Name #4",null,"Title\n#5","First Name #5","Last Name #5"]

{"sheet":"Rooming List","index":1,"n_rows":312,"n_cols":27,"rows_kept":312,"cut":false,"hidden":false,"merged":[[1,3,1,5]]}
[]
[null,null,"Group Name:"]
[]
[]
[]
[]
[null,null,null,null,null,null,null,"Rooming List Template"]
[]
[]
[null,null,"Reservation Information",null,null,null,null,null,null,{"$f":"IF(F4=1,IF(COUNTA(Table1[Email Address])>0,\"\",\"No Emails Entered\"),\"\")","v":""},null,"V2 01.17.23",null,null,null,"Special Requests & Comments (Requests cannot be guaranteed)",null,null,null,null,null,"Additional Guests"]
[null,null,null,null,null,null,null,null,null,{"$f":"F4","v":0}]
[null,"Title","First Name","Last Name","Arrival Date","Departure Date","Group Code [Hidden]","Billing Method","Bonvoy Number","Email Address","Room Type","Bed Type","School","VIP","Accessible","Special Request 1","Special Request  2","SRQ1","SRQ2","SRQ3","Comments","First Name2","Last Name2","First Name3","Last Name3","First Name4","Last Name4"]
[1,null,null,null,null,null,null,null,null,null,null,null,null,null,null,null,null,{"$f":"IF(Table1[[#This Row],[VIP]]=\"Yes\",\"V1\",\"\")","v":""},{"$f":"LEFT(Table1[[#This Row],[Special Request 1]],2)","v":""},{"$f":"LEFT(Table1[[#This Row],[Special Request  2]],2)","v":""}]
[2,null,null,null,null,null,null,null,null,null,null,null,null,null,null,null,null,{"$f":"IF(Table1[[#This Row],[VIP]]=\"Yes\",\"V1\",\"\")","v":""},{"$f":"LEFT(Table1[[#This Row],[Special Request 1]],2)","v":""},{"$f":"LEFT(Table1[[#This Row],[Special Request  2]],2)","v":""}]
[3,null,null,null,null,null,null,null,null,null,null,null,null,null,null,null,null,{"$f":"IF(Table1[[#This Row],[VIP]]=\"Yes\",\"V1\",\"\")","v":""},{"$f":"LEFT(Table1[[#This Row],[Special Request 1]],2)","v":""},{"$f":"LEFT(Table1[[#This Row],[Special Request  2]],2)","v":""}]
[4,null,null,null,null,null,null,null,null,null,null,null,null,null,null,null,null,{"$f":"IF(Table1[[#This Row],[VIP]]=\"Yes\",\"V1\",\"\")","v":""},{"$f":"LEFT(Table1[[#This Row],[Special Request 1]],2)","v":""},{"$f":"LEFT(Table1[[#This Row],[Special Request  2]],2)","v":""}]
[5,null,null,null,null,null,null,null,null,null,null,null,null,null,null,null,null,{"$f":"IF(Table1[[#This Row],[VIP]]=\"Yes\",\"V1\",\"\")","v":""},{"$f":"LEFT(Table1[[#This Row],[Special Request 1]],2)","v":""},{"$f":"LEFT(Table1[[#This Row],[Special Request  2]],2)","v":""}]
[6,null,null,null,null,null,null,null,null,null,null,null,null,null,null,null,null,{"$f":"IF(Table1[[#This Row],[VIP]]=\"Yes\",\"V1\",\"\")","v":""},{"$f":"LEFT(Table1[[#This Row],[Special Request 1]],2)","v":""},{"$f":"LEFT(Table1[[#This Row],[Special Request  2]],2)","v":""}]
[7,null,null,null,null,null,null,null,null,null,null,null,null,null,null,null,null,{"$f":"IF(Table1[[#This Row],[VIP]]=\"Yes\",\"V1\",\"\")","v":""},{"$f":"LEFT(Table1[[#This Row],[Special Request 1]],2)","v":""},{"$f":"LEFT(Table1[[#This Row],[Special Request  2]],2)","v":""}]
[8,null,null,null,null,null,null,null,null,null,null,null,null,null,null,null,null,{"$f":"IF(Table1[[#This Row],[VIP]]=\"Yes\",\"V1\",\"\")","v":""},{"$f":"LEFT(Table1[[#This Row],[Special Request 1]],2)","v":""},{"$f":"LEFT(Table1[[#This Row],[Special Request  2]],2)","v":""}]
[9,null,null,null,null,null,null,null,null,null,null,null,null,null,null,null,null,{"$f":"IF(Table1[[#This Row],[VIP]]=\"Yes\",\"V1\",\"\")","v":""},{"$f":"LEFT(Table1[[#This Row],[Special Request 1]],2)","v":""},{"$f":"LEFT(Table1[[#This Row],[Special Request  2]],2)","v":""}]
[10,null,null,null,null,null,null,null,null,null,null,null,null,null,null,null,null,{"$f":"IF(Table1[[#This Row],[VIP]]=\"Yes\",\"V1\",\"\")","v":""},{"$f":"LEFT(Table1[[#This Row],[Special Request 1]],2)","v":""},{"$f":"LEFT(Table1[[#This Row],[Special Request  2]],2)","v":""}]
[11,null,null,null,null,null,null,null,null,null,null,null,null,null,null,null,null,{"$f":"IF(Table1[[#This Row],[VIP]]=\"Yes\",\"V1\",\"\")","v":""},{"$f":"LEFT(Table1[[#This Row],[Special Request 1]],2)","v":""},{"$f":"LEFT(Table1[[#This Row],[Special Request  2]],2)","v":""}]
[12,null,null,null,null,null,null,null,null,null,null,null,null,null,null,null,null,{"$f":"IF(Table1[[#This Row],[VIP]]=\"Yes\",\"V1\",\"\")","v":""},{"$f":"LEFT(Table1[[#This Row],[Special Request 1]],2)","v":""},{"$f":"LEFT(Table1[[#This Row],[Special Request  2]],2)","v":""}]
[13,null,null,null,null,null,null,null,null,null,null,null,null,null,null,null,null,{"$f":"IF(Table1[[#This Row],[VIP]]=\"Yes\",\"V1\",\"\")","v":""},{"$f":"LEFT(Table1[[#This Row],[Special Request 1]],2)","v":""},{"$f":"LEFT(Table1[[#This Row],[Special Request  2]],2)","v":""}]
[14,null,null,null,null,null,null,null,null,null,null,null,null,null,null,null,null,{"$f":"IF(Table1[[#This Row],[VIP]]=\"Yes\",\"V1\",\"\")","v":""},{"$f":"LEFT(Table1[[#This Row],[Special Request 1]],2)","v":""},{"$f":"LEFT(Table1[[#This Row],[Special Request  2]],2)","v":""}]
[15,null,null,null,null,null,null,null,null,null,null,null,null,null,null,null,null,{"$f":"IF(Table1[[#This Row],[VIP]]=\"Yes\",\"V1\",\"\")","v":""},{"$f":"LEFT(Table1[[#This Row],[Special Request 1]],2)","v":""},{"$f":"LEFT(Table1[[#This Row],[Special Request  2]],2)","v":""}]
[16,null,null,null,null,null,null,null,null,null,null,null,null,null,null,null,null,{"$f":"IF(Table1[[#This Row],[VIP]]=\"Yes\",\"V1\",\"\")","v":""},{"$f":"LEFT(Table1[[#This Row],[Special Request 1]],2)","v":""},{"$f":"LEFT(Table1[[#This Row],[Special Request  2]],2)","v":""}]
[17,null,null,null,null,null,null,null,null,null,null,null,null,null,null,null,null,{"$f":"IF(Table1[[#This Row],[VIP]]=\"Yes\",\"V1\",\"\")","v":""},{"$f":"LEFT(Table1[[#This Row],[Special Request 1]],2)","v":""},{"$f":"LEFT(Table1[[#This Row],[Special Request  2]],2)","v":""}]
[18,null,null,null,null,null,null,null,null,null,null,null,null,null,null,null,null,{"$f":"IF(Table1[[#This Row],[VIP]]=\"Yes\",\"V1\",\"\")","v":""},{"$f":"LEFT(Table1[[#This Row],[Special Request 1]],2)","v":""},{"$f":"LEFT(Table1[[#This Row],[Special Request  2]],2)","v":""}]
[19,null,null,null,null,null,null,null,null,null,null,null,null,null,null,null,null,{"$f":"IF(Table1[[#This Row],[VIP]]=\"Yes\",\"V1\",\"\")","v":""},{"$f":"LEFT(Table1[[#This Row],[Special Request 1]],2)","v":""},{"$f":"LEFT(Table1[[#This Row],[Special Request  2]],2)","v":""}]
[20,null,null,null,null,null,null,null,null,null,null,null,null,null,null,null,null,{"$f":"IF(Table1[[#This Row],[VIP]]=\"Yes\",\"V1\",\"\")","v":""},{"$f":"LEFT(Table1[[#This Row],[Special Request 1]],2)","v":""},{"$f":"LEFT(Table1[[#This Row],[Special Request  2]],2)","v":""}]
[21,null,null,null,null,null,null,null,null,null,null,null,null,null,null,null,null,{"$f":"IF(Table1[[#This Row],[VIP]]=\"Yes\",\"V1\",\"\")","v":""},{"$f":"LEFT(Table1[[#This Row],[Special Request 1]],2)","v":""},{"$f":"LEFT(Table1[[#This Row],[Special Request  2]],2)","v":""}]
[22,null,null,null,null,null,null,null,null,null,null,null,null,null,null,null,null,{"$f":"IF(Table1[[#This Row],[VIP]]=\"Yes\",\"V1\",\"\")","v":""},{"$f":"LEFT(Table1[[#This Row],[Special Request 1]],2)","v":""},{"$f":"LEFT(Table1[[#This Row],[Special Request  2]],2)","v":""}]
[23,null,null,null,null,null,null,null,null,null,null,null,null,null,null,null,null,{"$f":"IF(Table1[[#This Row],[VIP]]=\"Yes\",\"V1\",\"\")","v":""},{"$f":"LEFT(Table1[[#This Row],[Special Request 1]],2)","v":""},{"$f":"LEFT(Table1[[#This Row],[Special Request  2]],2)","v":""}]
[24,null,null,null,null,null,null,null,null,null,null,null,null,null,null,null,null,{"$f":"IF(Table1[[#This Row],[VIP]]=\"Yes\",\"V1\",\"\")","v":""},{"$f":"LEFT(Table1[[#This Row],[Special Request 1]],2)","v":""},{"$f":"LEFT(Table1[[#This Row],[Special Request  2]],2)","v":""}]
[25,null,null,null,null,null,null,null,null,null,null,null,null,null,null,null,null,{"$f":"IF(Table1[[#This Row],[VIP]]=\"Yes\",\"V1\",\"\")","v":""},{"$f":"LEFT(Table1[[#This Row],[Special Request 1]],2)","v":""},{"$f":"LEFT(Table1[[#This Row],[Special Request  2]],2)","v":""}]
[26,null,null,null,null,null,null,null,null,null,null,null,null,null,null,null,null,{"$f":"IF(Table1[[#This Row],[VIP]]=\"Yes\",\"V1\",\"\")","v":""},{"$f":"LEFT(Table1[[#This Row],[Special Request 1]],2)","v":""},{"$f":"LEFT(Table1[[#This Row],[Special Request  2]],2)","v":""}]
[27,null,null,null,null,null,null,null,null,null,null,null,null,null,null,null,null,{"$f":"IF(Table1[[#This Row],[VIP]]=\"Yes\",\"V1\",\"\")","v":""},{"$f":"LEFT(Table1[[#This Row],[Special Request 1]],2)","v":""},{"$f":"LEFT(Table1[[#This Row],[Special Request  2]],2)","v":""}]
[28,null,null,null,null,null,null,null,null,null,null,null,null,null,null,null,null,{"$f":"IF(Table1[[#This Row],[VIP]]=\"Yes\",\"V1\",\"\")","v":""},{"$f":"LEFT(Table1[[#This Row],[Special Request 1]],2)","v":""},{"$f":"LEFT(Table1[[#This Row],[Special Request  2]],2)","v":""}]
{"$rows_left_out":273}
{"sheet":"Stay Pattern","index":2,"n_rows":306,"n_cols":38,"rows_kept":306,"cut":false,"hidden":false,"merged":[[1,3,1,5]]}
[]
[null,null,"Group Name:",{"$f":"'Rooming List'!D2:F2","v":"00:00:00"}]
[]
[null,null,null,null,null,null,null,{"$f":"TEXT(H5,\"ddd\")","v":"Sat"},{"$f":"TEXT(I5,\"ddd\")","v":"Sun"},"Mon","Tue","Wed","Thu","Fri","Sat","Sun","Mon","Tue","Wed","Thu","Fri","Sat","Sun","Mon","Tue","Wed","Thu","Fri","Sat","Sun","Mon","Tue","Wed","Thu","Fri","Sat","Sun","Mon"]
[null,null,"First Name","Last Name","Arrival Date","Departure Date","Total Nts",{"$f":"MIN(E:E)","v":"00:00:00"},{"$f":"H5+1","v":"1900-01-01"},{"$f":"I5+1","v":"1900-01-02"},"1900-01-03","1900-01-04","1900-01-05","1900-01-06","1900-01-07","1900-01-08","1900-01-09","1900-01-10","1900-01-11","1900-01-12","1900-01-13","1900-01-14","1900-01-15","1900-01-16","1900-01-17","1900-01-18","1900-01-19","1900-01-20","1900-01-21","1900-01-22","1900-01-23","1900-01-24","1900-01-25","1900-01-26","1900-01-27","1900-01-28","1900-01-29","1900-01-30"]
[null,null,null,null,null,null,{"$f":"SUM(G7:G306)","v":0},{"$f":"SUM(H7:H306)","v":0},0,0,0,0,0,0,0,0,0,0,0,0,0,0,0,0,0,0,0,0,0,0,0,0,0,0,0,0,0,0]
[null,1,{"$f":"'Rooming List'!C13","v":0},{"$f":"'Rooming List'!D13","v":0},{"$f":"IF(ISBLANK('Rooming List'!E13),\"\",'Rooming List'!E13)","v":""},{"$f":"'Rooming List'!F13","v":"00:00:00"},{"$f":"SUM(H7:AL7)","v":0},{"$f":"IF(AND(H$5>=$E7,H$5<$F7),1,0)","v":0},{"$f":"IF(AND(I$5>=$E7,I$5<$F7),1,0)","v":0},0,0,0,0,0,0,0,0,0,0,0,0,0,0,0,0,0,0,0,0,0,0,0,0,0,0,0,0,0]
[null,2,{"$f":"'Rooming List'!C14","v":0},{"$f":"'Rooming List'!D14","v":0},{"$f":"IF(ISBLANK('Rooming List'!E14),\"\",'Rooming List'!E14)","v":""},{"$f":"'Rooming List'!F14","v":"00:00:00"},{"$f":"SUM(H8:AL8)","v":0},{"$f":"IF(AND(H$5>=$E8,H$5<$F8),1,0)","v":0},0,0,0,0,0,0,0,0,0,0,0,0,0,0,0,0,0,0,0,0,0,0,0,0,0,0,0,0,0,0]
[null,3,{"$f":"'Rooming List'!C15","v":0},{"$f":"'Rooming List'!D15","v":0},{"$f":"IF(ISBLANK('Rooming List'!E15),\"\",'Rooming List'!E15)","v":""},{"$f":"'Rooming List'!F15","v":"00:00:00"},0,0,0,0,0,0,0,0,0,0,0,0,0,0,0,0,0,0,0,0,0,0,0,0,0,0,0,0,0,0,0,0]
[null,4,{"$f":"'Rooming List'!C16","v":0},{"$f":"'Rooming List'!D16","v":0},{"$f":"IF(ISBLANK('Rooming List'!E16),\"\",'Rooming List'!E16)","v":""},{"$f":"'Rooming List'!F16","v":"00:00:00"},0,0,0,0,0,0,0,0,0,0,0,0,0,0,0,0,0,0,0,0,0,0,0,0,0,0,0,0,0,0,0,0]
[null,5,{"$f":"'Rooming List'!C17","v":0},{"$f":"'Rooming List'!D17","v":0},{"$f":"IF(ISBLANK('Rooming List'!E17),\"\",'Rooming List'!E17)","v":""},{"$f":"'Rooming List'!F17","v":"00:00:00"},0,0,0,0,0,0,0,0,0,0,0,0,0,0,0,0,0,0,0,0,0,0,0,0,0,0,0,0,0,0,0,0]
[null,6,{"$f":"'Rooming List'!C18","v":0},{"$f":"'Rooming List'!D18","v":0},{"$f":"IF(ISBLANK('Rooming List'!E18),\"\",'Rooming List'!E18)","v":""},{"$f":"'Rooming List'!F18","v":"00:00:00"},0,0,0,0,0,0,0,0,0,0,0,0,0,0,0,0,0,0,0,0,0,0,0,0,0,0,0,0,0,0,0,0]
[null,7,{"$f":"'Rooming List'!C19","v":0},{"$f":"'Rooming List'!D19","v":0},{"$f":"IF(ISBLANK('Rooming List'!E19),\"\",'Rooming List'!E19)","v":""},{"$f":"'Rooming List'!F19","v":"00:00:00"},0,0,0,0,0,0,0,0,0,0,0,0,0,0,0,0,0,0,0,0,0,0,0,0,0,0,0,0,0,0,0,0]
[null,8,{"$f":"'Rooming List'!C20","v":0},{"$f":"'Rooming List'!D20","v":0},{"$f":"IF(ISBLANK('Rooming List'!E20),\"\",'Rooming List'!E20)","v":""},{"$f":"'Rooming List'!F20","v":"00:00:00"},0,0,0,0,0,0,0,0,0,0,0,0,0,0,0,0,0,0,0,0,0,0,0,0,0,0,0,0,0,0,0,0]
[null,9,{"$f":"'Rooming List'!C21","v":0},{"$f":"'Rooming List'!D21","v":0},{"$f":"IF(ISBLANK('Rooming List'!E21),\"\",'Rooming List'!E21)","v":""},{"$f":"'Rooming List'!F21","v":"00:00:00"},0,0,0,0,0,0,0,0,0,0,0,0,0,0,0,0,0,{"$f":"IF(AND(X$5>=$E15,X$5<$F15),1,0)","v":0},0,0,0,0,0,0,0,0,0,0,0,0,0,0]
[null,10,{"$f":"'Rooming List'!C22","v":0},{"$f":"'Rooming List'!D22","v":0},{"$f":"IF(ISBLANK('Rooming List'!E22),\"\",'Rooming List'!E22)","v":""},{"$f":"'Rooming List'!F22","v":"00:00:00"},0,0,0,0,0,0,0,0,0,0,0,0,0,0,0,0,0,0,0,0,0,0,0,0,0,0,0,0,0,0,0,0]
[null,11,{"$f":"'Rooming List'!C23","v":0},{"$f":"'Rooming List'!D23","v":0},{"$f":"IF(ISBLANK('Rooming List'!E23),\"\",'Rooming List'!E23)","v":""},{"$f":"'Rooming List'!F23","v":"00:00:00"},0,0,0,0,0,0,0,0,0,0,0,0,0,0,0,0,0,0,0,0,0,0,0,0,0,0,0,0,0,0,0,0]
[null,12,{"$f":"'Rooming List'!C24","v":0},{"$f":"'Rooming List'!D24","v":0},{"$f":"IF(ISBLANK('Rooming List'!E24),\"\",'Rooming List'!E24)","v":""},{"$f":"'Rooming List'!F24","v":"00:00:00"},0,0,0,0,0,0,0,0,0,0,0,0,0,0,0,0,0,0,0,0,0,0,0,0,0,0,0,0,0,0,0,0]
[null,13,{"$f":"'Rooming List'!C25","v":0},{"$f":"'Rooming List'!D25","v":0},{"$f":"IF(ISBLANK('Rooming List'!E25),\"\",'Rooming List'!E25)","v":""},{"$f":"'Rooming List'!F25","v":"00:00:00"},0,0,0,0,0,0,0,0,0,0,0,0,0,0,0,0,0,0,0,0,0,0,0,0,0,0,0,0,0,0,0,0]
[null,14,{"$f":"'Rooming List'!C26","v":0},{"$f":"'Rooming List'!D26","v":0},{"$f":"IF(ISBLANK('Rooming List'!E26),\"\",'Rooming List'!E26)","v":""},{"$f":"'Rooming List'!F26","v":"00:00:00"},0,0,0,0,0,0,0,0,0,0,0,0,0,0,0,0,0,0,0,0,0,0,0,0,0,0,0,0,0,0,0,0]
[null,15,{"$f":"'Rooming List'!C27","v":0},{"$f":"'Rooming List'!D27","v":0},{"$f":"IF(ISBLANK('Rooming List'!E27),\"\",'Rooming List'!E27)","v":""},{"$f":"'Rooming List'!F27","v":"00:00:00"},0,0,0,0,0,0,0,0,0,0,0,0,0,0,0,0,0,0,0,0,0,0,0,0,0,0,0,0,0,0,0,0]
[null,16,{"$f":"'Rooming List'!C28","v":0},{"$f":"'Rooming List'!D28","v":0},{"$f":"IF(ISBLANK('Rooming List'!E28),\"\",'Rooming List'!E28)","v":""},{"$f":"'Rooming List'!F28","v":"00:00:00"},0,0,0,0,0,0,0,0,0,0,0,0,0,0,0,0,0,0,0,0,0,0,0,0,0,0,0,0,0,0,0,0]
[null,17,{"$f":"'Rooming List'!C29","v":0},{"$f":"'Rooming List'!D29","v":0},{"$f":"IF(ISBLANK('Rooming List'!E29),\"\",'Rooming List'!E29)","v":""},{"$f":"'Rooming List'!F29","v":"00:00:00"},0,0,0,0,0,0,0,0,0,0,0,0,0,0,0,0,0,0,0,0,0,0,0,0,0,0,0,0,0,0,0,0]
[null,18,{"$f":"'Rooming List'!C30","v":0},{"$f":"'Rooming List'!D30","v":0},{"$f":"IF(ISBLANK('Rooming List'!E30),\"\",'Rooming List'!E30)","v":""},{"$f":"'Rooming List'!F30","v":"00:00:00"},0,0,0,0,0,0,0,0,0,0,0,0,0,0,0,0,0,0,0,0,0,0,0,0,0,0,0,0,0,0,0,0]
[null,19,{"$f":"'Rooming List'!C31","v":0},{"$f":"'Rooming List'!D31","v":0},{"$f":"IF(ISBLANK('Rooming List'!E31),\"\",'Rooming List'!E31)","v":""},{"$f":"'Rooming List'!F31","v":"00:00:00"},0,0,0,0,0,0,0,0,0,0,0,0,0,0,0,0,0,0,0,0,0,0,0,0,0,0,0,0,0,0,0,0]
[null,20,{"$f":"'Rooming List'!C32","v":0},{"$f":"'Rooming List'!D32","v":0},{"$f":"IF(ISBLANK('Rooming List'!E32),\"\",'Rooming List'!E32)","v":""},{"$f":"'Rooming List'!F32","v":"00:00:00"},0,0,0,0,0,0,0,0,0,0,0,0,0,0,0,0,0,0,0,0,0,0,0,0,0,0,0,0,0,0,0,0]
[null,21,{"$f":"'Rooming List'!C33","v":0},{"$f":"'Rooming List'!D33","v":0},{"$f":"IF(ISBLANK('Rooming List'!E33),\"\",'Rooming List'!E33)","v":""},{"$f":"'Rooming List'!F33","v":"00:00:00"},0,0,0,0,0,0,0,0,0,0,0,0,0,0,0,0,0,0,0,0,0,0,0,0,0,0,0,0,0,0,0,0]
[null,22,{"$f":"'Rooming List'!C34","v":0},{"$f":"'Rooming List'!D34","v":0},{"$f":"IF(ISBLANK('Rooming List'!E34),\"\",'Rooming List'!E34)","v":""},{"$f":"'Rooming List'!F34","v":"00:00:00"},0,0,0,0,0,0,0,0,0,0,0,0,0,0,0,0,0,0,0,0,0,0,0,0,0,0,0,0,0,0,0,0]
[null,23,{"$f":"'Rooming List'!C35","v":0},{"$f":"'Rooming List'!D35","v":0},{"$f":"IF(ISBLANK('Rooming List'!E35),\"\",'Rooming List'!E35)","v":""},{"$f":"'Rooming List'!F35","v":"00:00:00"},0,0,0,0,0,0,0,0,0,0,0,0,0,0,0,0,0,0,0,0,0,0,0,0,0,0,0,0,0,0,0,0]
[null,24,{"$f":"'Rooming List'!C36","v":0},{"$f":"'Rooming List'!D36","v":0},{"$f":"IF(ISBLANK('Rooming List'!E36),\"\",'Rooming List'!E36)","v":""},{"$f":"'Rooming List'!F36","v":"00:00:00"},0,0,0,0,0,0,0,0,0,0,0,0,0,0,0,0,0,0,0,0,0,0,0,0,0,0,0,0,0,0,0,0]
[null,25,{"$f":"'Rooming List'!C37","v":0},{"$f":"'Rooming List'!D37","v":0},{"$f":"IF(ISBLANK('Rooming List'!E37),\"\",'Rooming List'!E37)","v":""},{"$f":"'Rooming List'!F37","v":"00:00:00"},0,0,0,0,0,0,0,0,{"$f":"IF(AND(O$5>=$E31,O$5<$F31),1,0)","v":0},0,0,0,0,0,0,0,0,0,0,0,0,0,0,0,0,0,0,0,0,0,0,0]
[null,26,{"$f":"'Rooming List'!C38","v":0},{"$f":"'Rooming List'!D38","v":0},{"$f":"IF(ISBLANK('Rooming List'!E38),\"\",'Rooming List'!E38)","v":""},{"$f":"'Rooming List'!F38","v":"00:00:00"},0,{"$f":"IF(AND(H$5>=$E32,H$5<$F32),1,0)","v":0},0,0,0,0,0,0,0,0,0,0,0,0,0,0,0,0,0,0,0,0,0,0,0,0,0,0,0,0,0,{"$f":"IF(AND(AL$5>=$E32,AL$5<$F32),1,0)","v":0}]
[null,27,{"$f":"'Rooming List'!C39","v":0},{"$f":"'Rooming List'!D39","v":0},{"$f":"IF(ISBLANK('Rooming List'!E39),\"\",'Rooming List'!E39)","v":""},{"$f":"'Rooming List'!F39","v":"00:00:00"},0,0,0,0,0,0,0,0,0,0,0,0,0,0,0,0,0,0,0,0,0,0,0,0,0,0,0,0,0,0,0,0]
[null,28,{"$f":"'Rooming List'!C40","v":0},{"$f":"'Rooming List'!D40","v":0},{"$f":"IF(ISBLANK('Rooming List'!E40),\"\",'Rooming List'!E40)","v":""},{"$f":"'Rooming List'!F40","v":"00:00:00"},0,0,0,0,0,0,0,0,0,0,0,0,0,0,0,0,0,0,0,0,0,0,0,0,0,0,0,0,0,0,0,0]
[null,29,{"$f":"'Rooming List'!C41","v":0},{"$f":"'Rooming List'!D41","v":0},{"$f":"IF(ISBLANK('Rooming List'!E41),\"\",'Rooming List'!E41)","v":""},{"$f":"'Rooming List'!F41","v":"00:00:00"},0,0,0,0,0,0,0,0,0,0,0,0,0,0,0,0,0,0,0,0,0,0,0,0,0,0,0,0,0,0,0,0]
[null,30,{"$f":"'Rooming List'!C42","v":0},{"$f":"'Rooming List'!D42","v":0},{"$f":"IF(ISBLANK('Rooming List'!E42),\"\",'Rooming List'!E42)","v":""},{"$f":"'Rooming List'!F42","v":"00:00:00"},0,0,0,0,0,0,0,0,0,0,0,0,0,0,0,0,0,0,0,0,0,0,0,0,0,0,0,0,0,0,0,0]
[null,31,{"$f":"'Rooming List'!C43","v":0},{"$f":"'Rooming List'!D43","v":0},{"$f":"IF(ISBLANK('Rooming List'!E43),\"\",'Rooming List'!E43)","v":""},{"$f":"'Rooming List'!F43","v":"00:00:00"},0,0,0,0,0,0,0,0,0,0,0,0,0,0,0,0,0,0,0,0,0,0,0,0,0,0,0,0,0,0,0,0]
[null,32,{"$f":"'Rooming List'!C44","v":0},{"$f":"'Rooming List'!D44","v":0},{"$f":"IF(ISBLANK('Rooming List'!E44),\"\",'Rooming List'!E44)","v":""},{"$f":"'Rooming List'!F44","v":"00:00:00"},0,0,0,0,0,0,0,0,0,0,0,0,0,0,0,0,0,0,0,0,0,0,0,0,0,0,0,0,0,0,0,0]
[null,33,{"$f":"'Rooming List'!C45","v":0},{"$f":"'Rooming List'!D45","v":0},{"$f":"IF(ISBLANK('Rooming List'!E45),\"\",'Rooming List'!E45)","v":""},{"$f":"'Rooming List'!F45","v":"00:00:00"},0,0,0,0,0,0,0,0,0,0,0,0,0,0,0,0,0,0,0,0,0,0,0,0,0,0,0,0,0,0,0,0]
[null,34,{"$f":"'Rooming List'!C46","v":0},{"$f":"'Rooming List'!D46","v":0},{"$f":"IF(ISBLANK('Rooming List'!E46),\"\",'Rooming List'!E46)","v":""},{"$f":"'Rooming List'!F46","v":"00:00:00"},0,0,0,0,0,0,0,0,0,0,0,0,0,0,0,0,0,0,0,0,0,0,0,0,0,0,0,0,0,0,0,0]
{"$rows_left_out":267}
{"sheet":"Hidden - Lists","index":3,"n_rows":13,"n_cols":17,"rows_kept":13,"cut":false,"hidden":true,"merged":[[10,6,12,6],[4,8,4,12],[8,14,9,14],[10,3,11,3],[10,5,12,5]]}
[]
[null,"Billing_Method",null,"Room_Type",null,"Bed_Type","Bed_Type",null,"Guest_Conf",null,"Accessible",null,"VIP",null,"Title",null,"Special Requests"]
[null,"EPO - Each pays own",null,"Standard",null,null,"No Preference",null,"Yes",null,"Yes",null,"Yes",null,"Mr",null,"B5 - Feather Free"]
[null,"SRT - Incidentals Gtd by Company",null,"Concierge",null,null,"1 King Bed",null,"No",null,"No",null,"No",null,"Mrs",null,"H1 - High Floor"]
[null,"SRT - Incidentals Gtd by Individual",null,"Staff",null,null,"2 Double Bed",null,"^---   DO NOT ADD OR CHANGE   ---^",null,null,null,null,null,"Ms",null,"L2 - Low Floor Room"]
[null,"SAC - Sign all Charges",null,"Hospitality",null,null,null,null,null,null,null,null,null,null,"Miss",null,"N1 - Near Elevator"]
[null,"DO NOT ADD OR CHANGE",null,"Executive Suite",null,null,null,null,null,null,null,null,null,null,"Dr",null,"B7 - Away from Elevator"]
[null,null,null,"Presidential Suite",null,null,null,null,null,null,null,null,null,null,"Sheik"]
[null,"MARSHA PROPERTY CODE",null,"Special",null,null,null,null,null,null,null,null,null,null,"DO NOT ADD OR CHANGE"]
[null,null,null,"Other"]
[null,null,null,"Remove or add as needed ",null,"DO NOT PUT ANYTHING IN THIS SECTION","Delete any not needed, do not add"]
[]
[null,null,null,null,null,null,null,null,null,null,null,null,null,null,null,null,"Remove or add as needed "]